Target
Cytidine deaminase
Ligand
BDBM50391219
Substrate
Meas. Tech.
ChEBML_52523
Ki
40±n/a nM
Citation
 Liu, PSMarquez, VEDriscoll, JSFuller, RWMcCormack, JJ Cyclic urea nucleosides. Cytidine deaminase activity as a function of aglycon ring size. J Med Chem 24:662-6 (1981)  
Target
Name:
Cytidine deaminase
Synonyms:
CDA CDD_HUMAN Cytidine deaminase (CDA)
Type:
Ezyme
Mol. Mass.:
16185.04
Organism:
Homo sapiens (Human)
Description:
P32320
Residue:
146
  
Inhibitor
Name:
BDBM50391219
Synonyms:
CHEMBL2093931
Type:
Small organic molecule
Emp. Form.:
C10H18N2O6
Mol. Mass.:
262.2597
SMILES:
OC[C@H]1O[C@H]([C@H](O)[C@@H]1O)N1CC[C@@H](O)CNC1=O
: