Target
Adenylate kinase isoenzyme 1
Ligand
BDBM50366480
Substrate
Meas. Tech.
ChEBML_32228
Ki
570000±n/a nM
Citation
 Kappler, FHai, TTAbo, MHampton, A Species- or isozyme-specific enzyme inhibitors. 8. Synthesis of disubstituted two-substrate condensation products as inhibitors of rat adenylate kinases. J Med Chem 25:1179-84 (1983)  
Target
Name:
Adenylate kinase isoenzyme 1
Synonyms:
Adenylate kinase 1 KAD1_RAT
Type:
PROTEIN
Mol. Mass.:
21585.03
Organism:
Rattus norvegicus
Description:
ChEMBL_29909
Residue:
194
  
Inhibitor
Name:
BDBM50366480
Synonyms:
ADENOSINE TRIPHOSPHATE | ATP
Type:
Small organic molecule
Emp. Form.:
C10H16N5O13P3
Mol. Mass.:
507.181
SMILES:
Nc1ncnc2n(cnc12)[C@@H]1O[C@H](CO[P@](O)(=O)O[P@@](O)(=O)OP(O)(O)=O)[C@@H](O)[C@H]1O
: