Target
Mu-type opioid receptor
Ligand
BDBM50027508
Substrate
Meas. Tech.
ChEMBL_146244 (CHEMBL753436)
IC50
7.6±n/a nM
Citation
 DiMaio, JNguyen, TMLemieux, CSchiller, PW Synthesis and pharmacological characterization in vitro of cyclic enkephalin analogues: effect of conformational constraints on opiate receptor selectivity. J Med Chem 25:1432-8 (1983)  
Target
Name:
Mu-type opioid receptor
Synonyms:
M-OR-1 Mu opioid receptor OPIATE Mu OPRM_CAVPO
Type:
Enzyme Catalytic Domain
Mol. Mass.:
11165.58
Organism:
GUINEA PIG
Description:
P97266
Residue:
98
  
Inhibitor
Name:
BDBM50027508
Synonyms:
Acetate1-(6-benzyl-3-isobutyl-2,5,8,11-tetraoxo-1,4,7,10tetraaza-cyclohexadec-12-ylcarbamoyl)-2-(4-hydroxy-phenyl)-ethyl-ammonium; | CHEMBL2372197
Type:
Small organic molecule
Emp. Form.:
C31H44N6O8
Mol. Mass.:
628.7165
SMILES:
CC(O)=O.CC(C)C[C@H](NC(=O)[C@H](Cc1ccccc1)NC(=O)CNC(=O)[C@@H](C)NC(=O)[C@@H](N)Cc1ccc(O)cc1)C(N)=O
: