Target
Delta-type opioid receptor
Ligand
BDBM50027506
Substrate
Meas. Tech.
ChEMBL_222115 (CHEMBL843711)
Ki
45±n/a nM
Citation
 DiMaio, JNguyen, TMLemieux, CSchiller, PW Synthesis and pharmacological characterization in vitro of cyclic enkephalin analogues: effect of conformational constraints on opiate receptor selectivity. J Med Chem 25:1432-8 (1983)  
Target
Name:
Delta-type opioid receptor
Synonyms:
Cytochrome P450 3A4 Delta opioid receptor Delta-type opioid receptor (DOR) OPRD_RAT Opioid receptor Opioid receptors; mu & delta Ror-a | Voltage-gated potassium channel
Type:
G Protein-Coupled Receptor (GPCR)
Mol. Mass.:
40465.04
Organism:
Rattus norvegicus (rat)
Description:
Competition binding assays were using CHO-K1 cell membranes expressing the opioid receptor.
Residue:
372
  
Inhibitor
Name:
BDBM50027506
Synonyms:
Acetate1-(3-benzyl-2,5,8-trioxo-1,4,7triaza-cyclotridec-9-ylcarbamoyl)-2-(4-hydroxy-phenyl)-ethyl-ammonium; | CHEMBL2372200
Type:
Small organic molecule
Emp. Form.:
C28H37N5O7
Mol. Mass.:
555.6227
SMILES:
CC(O)=O.N[C@@H](Cc1ccc(O)cc1)C(=O)N[C@@H]1CCCCNC(=O)[C@H](Cc2ccccc2)NC(=O)CNC1=O
: