Target
Delta-type opioid receptor
Ligand
BDBM50027511
Substrate
Meas. Tech.
ChEMBL_147176 (CHEMBL754475)
Ki
3.1±n/a nM
Citation
 DiMaio, JNguyen, TMLemieux, CSchiller, PW Synthesis and pharmacological characterization in vitro of cyclic enkephalin analogues: effect of conformational constraints on opiate receptor selectivity. J Med Chem 25:1432-8 (1983)  
Target
Name:
Delta-type opioid receptor
Synonyms:
Cytochrome P450 3A4 Delta opioid receptor Delta-type opioid receptor (DOR) OPRD_RAT Opioid receptor Opioid receptors; mu & delta Ror-a | Voltage-gated potassium channel
Type:
G Protein-Coupled Receptor (GPCR)
Mol. Mass.:
40465.04
Organism:
Rattus norvegicus (rat)
Description:
Competition binding assays were using CHO-K1 cell membranes expressing the opioid receptor.
Residue:
372
  
Inhibitor
Name:
BDBM50027511
Synonyms:
Acetate1-[1-({[1-(1-carbamoyl-3-methyl-butylcarbamoyl)-2-phenyl-ethylcarbamoyl]-methyl}-carbamoyl)-butylcarbamoyl]-2-(4-hydroxy-phenyl)-ethyl-ammonium; | CHEMBL2372199
Type:
Small organic molecule
Emp. Form.:
C33H48N6O8
Mol. Mass.:
656.7696
SMILES:
CC(O)=O.CCC[C@@H](NC(=O)[C@@H](N)Cc1ccc(O)cc1)C(=O)NCC(=O)N[C@@H](Cc1ccccc1)C(=O)N[C@@H](CC(C)C)C(N)=O
: