Target
Adenosine receptor A1
Ligand
BDBM50009525
Substrate
Meas. Tech.
ChEBML_39959
Ki
25±n/a nM
Citation
 Daly, JW Adenosine receptors: targets for future drugs. J Med Chem 25:197-207 (1982)  
Target
Name:
Adenosine receptor A1
Synonyms:
AA1R_BOVIN ADENOSINE A1 high ADORA1 | Adenosine A1 receptor
Type:
Enzyme Catalytic Domain
Mol. Mass.:
36602.99
Organism:
BOVINE
Description:
ADENOSINE 0 BOVINE::P28190
Residue:
326
  
Inhibitor
Name:
BDBM50009525
Synonyms:
2-CI Adenosine 2-Chloroado CHEMBL285819
Type:
Small organic molecule
Emp. Form.:
C10H12ClN5O4
Mol. Mass.:
301.686
SMILES:
Nc1nc(Cl)nc2n(cnc12)[C@@H]1O[C@H](CO)[C@@H](O)[C@H]1O
: