Target
Amine oxidase [flavin-containing] B
Ligand
BDBM50367064
Substrate
Meas. Tech.
ChEBML_123925
IC50
>1±n/a nM
Citation
 Geyer, HMMartin, LLCrichlow, CADekow, FWEllis, DBKruse, HSetescak, LLWorm, M (+/-)-4-Aryl-4,5-dihydro-3H-1,3-benzodiazepines. 1. Synthesis and evaluation of (+/-)-4,5-dihydro-2,3-dimethyl-4-phenyl-3H-1,3-benzodiazepine and analogues as potential antidepressant agents. J Med Chem 25:340-6 (1982)  
Target
Name:
Amine oxidase [flavin-containing] B
Synonyms:
AOFB_RAT Amine oxidase [flavin-containing] B Monoamine Oxidase Type B (MAO-B) Monoamine oxidase B (MAO-B) Monoamine oxidase type B (MAOB) | Monoamine oxidase-B (MAO-B)
Type:
Enzyme
Mol. Mass.:
58469.65
Organism:
Rattus norvegicus (rat)
Description:
P19643
Residue:
520
  
Inhibitor
Name:
BDBM50367064
Synonyms:
CHEMBL1204338
Type:
Small organic molecule
Emp. Form.:
C17H18N2
Mol. Mass.:
250.3382
SMILES:
CN1C(Cc2ccccc2N=C1C)c1ccccc1
: