Target
Adenylate kinase 2, mitochondrial
Ligand
BDBM50367047
Substrate
Meas. Tech.
ChEMBL_32063 (CHEMBL644161)
Ki
21000000±n/a nM
Citation
 Hampton, AKappler, FPicker, D Species- or isozyme-specific enzyme inhibitors. 4. Design of a two-site inhibitor of adenylate kinase with isozyme selectivity. J Med Chem 25:638-44 (1982)  
Target
Name:
Adenylate kinase 2, mitochondrial
Synonyms:
2.7.4.3 ATP-AMP transphosphorylase 2 Adenylate kinase 2 Adenylate monophosphate kinase KAD2_RAT
Type:
Mol. Mass.:
26380.21
Organism:
Rattus norvegicus
Description:
Residue:
239
  
Inhibitor
Name:
BDBM50367047
Synonyms:
CHEMBL2368667
Type:
Small organic molecule
Emp. Form.:
C12H17N5NaO7PS
Mol. Mass.:
429.321
SMILES:
[Na+].CCSc1nc2c(N)ncnc2n1[C@@H]1O[C@H](COP(O)([O-])=O)[C@@H](O)[C@H]1O
: