Target
Beta-2 adrenergic receptor
Ligand
BDBM25764
Substrate
Meas. Tech.
ChEBML_37821
IC50
3±n/a nM
Citation
 Baldwin, JJMcClure, DEGross, DMWilliams, M Use of (S)-(trifloxymethyl)oxirane in the synthesis of a chiral beta-adrenoceptor antagonist, (R)- and (S)-9-[[3-(tert-butylamino)-2-hydroxypropyl]oximino]fluorene. J Med Chem 25:931-6 (1982)  
Target
Name:
Beta-2 adrenergic receptor
Synonyms:
ADRB2 Beta-2 adrenergic receptor Beta-2 adrenoreceptor | adrenergic Beta
Type:
Enzyme Catalytic Domain
Mol. Mass.:
47141.18
Organism:
BOVINE
Description:
adrenergic Beta ADRB2 BOVINE::Q28044
Residue:
418
  
Inhibitor
Name:
BDBM25764
Synonyms:
ALPRENOLOL,(+) Alfeprol Alprenolol {2-hydroxy-3-[2-(prop-2-en-1-yl)phenoxy]propyl}(propan-2-yl)amine
Type:
Small organic molecule
Emp. Form.:
C15H23NO2
Mol. Mass.:
249.3486
SMILES:
CC(C)NCC(O)COc1ccccc1CC=C
: