Target
Renin
Ligand
BDBM50224558
Substrate
Meas. Tech.
ChEMBL_192918 (CHEMBL799835)
Ki
1000000±n/a nM
Citation
 Johnson, RLVerschoor, K Inhibition of renin by angiotensinogen peptide fragments containing the hydroxy amino acid residue 5-amino-3-hydroxy-7-methyloctanoic acid. J Med Chem 26:1457-62 (1983)  
Target
Name:
Renin
Synonyms:
Angiotensinogenase RENI_HUMAN
Type:
Enzyme
Mol. Mass.:
45058.99
Organism:
Homo sapiens (Human)
Description:
Residue:
406
  
Inhibitor
Name:
BDBM50224558
Synonyms:
CHEMBL3216383
Type:
Small organic molecule
Emp. Form.:
C30H48Cl2N6O6
Mol. Mass.:
659.645
SMILES:
Cl.Cl.COC(=O)[C@@H](Cc1ccccc1)NC(=O)[C@H](NC(=O)CC(O)CC(CC(C)C)NC(=O)[C@@H](N)Cc1c[nH]cn1)C(C)C
: