Target
Transporter
Ligand
BDBM50026953
Substrate
Meas. Tech.
ChEBML_144836
IC50
6.8±n/a nM
Citation
 Bøgesø, KP Neuroleptic activity and dopamine-uptake inhibition in 1-piperazino-3-phenylindans. J Med Chem 26:935-47 (1983)  
Target
Name:
Transporter
Synonyms:
Monoamine transporters; Norepininephrine & dopamine | Norepinephrine Monoamine transporters
Type:
PROTEIN
Mol. Mass.:
66787.87
Organism:
Rattus norvegicus
Description:
ChEMBL_1463061
Residue:
597
  
Inhibitor
Name:
BDBM50026953
Synonyms:
(cis) 3-{4-[3-(3,4-Dichloro-phenyl)-indan-1-yl]-piperazin-1-yl}-propan-1-ol; Dihydrochloride CHEMBL176506
Type:
Small organic molecule
Emp. Form.:
C22H26Cl2N2O
Mol. Mass.:
405.361
SMILES:
OCCCN1CCN(CC1)C1CC(c2ccccc12)c1ccc(Cl)c(Cl)c1
: