Target
Angiotensin-converting enzyme
Ligand
BDBM50027720
Substrate
Meas. Tech.
ChEBML_34789
IC50
120±n/a nM
Citation
 Stanton, JLGruenfeld, NBabiarz, JEAckerman, MHFriedmann, RCYuan, AMMacchia, W Angiotensin converting enzyme inhibitors: N-substituted monocyclic and bicyclic amino acid derivatives. J Med Chem 26:1267-77 (1983)  
Target
Name:
Angiotensin-converting enzyme
Synonyms:
3.2.1.- ACE Angiotensin-converting enzyme, soluble form DCP1 Kininase II
Type:
Mol. Mass.:
150405.15
Organism:
Oryctolagus cuniculus
Description:
Residue:
1310
  
Inhibitor
Name:
BDBM50027720
Synonyms:
CHEMBL22381 | [(3,5-Dimethoxy-phenyl)-(3-mercapto-2-methyl-propionyl)-amino]-acetic acid
Type:
Small organic molecule
Emp. Form.:
C14H19NO5S
Mol. Mass.:
313.369
SMILES:
COc1cc(OC)cc(c1)N(CC(O)=O)C(=O)C(C)CS
: