Target
Angiotensin-converting enzyme
Ligand
BDBM50027698
Substrate
Meas. Tech.
ChEBML_34789
IC50
23±n/a nM
Citation
 Stanton, JLGruenfeld, NBabiarz, JEAckerman, MHFriedmann, RCYuan, AMMacchia, W Angiotensin converting enzyme inhibitors: N-substituted monocyclic and bicyclic amino acid derivatives. J Med Chem 26:1267-77 (1983)  
Target
Name:
Angiotensin-converting enzyme
Synonyms:
3.2.1.- ACE Angiotensin-converting enzyme, soluble form DCP1 Kininase II
Type:
Mol. Mass.:
150405.15
Organism:
Oryctolagus cuniculus
Description:
Residue:
1310
  
Inhibitor
Name:
BDBM50027698
Synonyms:
CHEMBL23534 | [(3-Mercapto-2-methyl-propionyl)-(4-propoxy-phenyl)-amino]-acetic acid
Type:
Small organic molecule
Emp. Form.:
C15H21NO4S
Mol. Mass.:
311.397
SMILES:
CCCOc1ccc(cc1)N(CC(O)=O)C(=O)C(C)CS
: