Target
Delta-type opioid receptor
Ligand
BDBM50240354
Substrate
Meas. Tech.
ChEBML_146640
EC50
8±n/a nM
Citation
 Burke, TRBajwa, BSJacobson, AERice, KCStreaty, RAKlee, WA Probes for narcotic receptor mediated phenomena. 7. Synthesis and pharmacological properties of irreversible ligands specific for mu or delta opiate receptors. J Med Chem 27:1570-4 (1985)  
Target
Name:
Delta-type opioid receptor
Synonyms:
Cytochrome P450 3A4 Delta opioid receptor Delta-type opioid receptor (DOR) OPRD_RAT Opioid receptor Opioid receptors; mu & delta Ror-a | Voltage-gated potassium channel
Type:
G Protein-Coupled Receptor (GPCR)
Mol. Mass.:
40465.04
Organism:
Rattus norvegicus (rat)
Description:
Competition binding assays were using CHO-K1 cell membranes expressing the opioid receptor.
Residue:
372
  
Inhibitor
Name:
BDBM50240354
Synonyms:
CHEMBL274844 | N-{1-[2-(4-Isothiocyanato-phenyl)-ethyl]-piperidin-4-yl}-N-phenyl-propionamide
Type:
Small organic molecule
Emp. Form.:
C23H27N3OS
Mol. Mass.:
393.545
SMILES:
CCC(=O)N(C1CCN(CCc2ccc(cc2)N=C=S)CC1)c1ccccc1
: