Target
Aminopeptidase N
Ligand
BDBM50027043
Substrate
Meas. Tech.
ChEMBL_35360 (CHEMBL647942)
Ki
16000±n/a nM
Citation
 Rich, DHMoon, BJHarbeson, S Inhibition of aminopeptidases by amastatin and bestatin derivatives. Effect of inhibitor structure on slow-binding processes. J Med Chem 27:417-22 (1984)  
Target
Name:
Aminopeptidase N
Synonyms:
AMPN_PIG AP-M Alanyl aminopeptidase Aminopeptidase N (APN) Microsomal aminopeptidase pAPN
Type:
Protein
Mol. Mass.:
108810.25
Organism:
Sus scrofa (Pig)
Description:
P15145
Residue:
963
  
Inhibitor
Name:
BDBM50027043
Synonyms:
3-Amino-2-hydroxy-N-(3-methyl-butyl)-4-phenyl-butyramide | CHEMBL134319
Type:
Small organic molecule
Emp. Form.:
C15H24N2O2
Mol. Mass.:
264.3633
SMILES:
CC(C)CCNC(=O)[C@H](O)[C@@H](N)Cc1ccccc1
: