Target
Sodium-dependent dopamine transporter
Ligand
BDBM50452190
Substrate
Meas. Tech.
ChEBML_184435
Ki
0.860000±n/a nM
Citation
 Maryanoff, BEMcComsey, DFCastanzo, MJSetler, PEGardocki, JFShank, RPSchneider, CR Pyrroloisoquinoline antidepressants. Potent, enantioselective inhibition of tetrabenazine-induced ptosis and neuronal uptake of norepinephrine, dopamine, and serotonin. J Med Chem 27:943-6 (1984)  
Target
Name:
Sodium-dependent dopamine transporter
Synonyms:
DA transporter SC6A3_RAT Sodium-dependent dopamine transporter | Sodium-dependent dopamine transporter (DAT)
Type:
Multi-pass membrane protein
Mol. Mass.:
68749.45
Organism:
Rattus norvegicus (rat)
Description:
P23977
Residue:
619
  
Inhibitor
Name:
BDBM50452190
Synonyms:
CHEMBL2093944
Type:
Small organic molecule
Emp. Form.:
C18H21BrN2
Mol. Mass.:
345.277
SMILES:
Br.[H][C@@]12CCCN1C[C@H](c1ccc(N)cc1)c1ccccc21
: