Target
Sodium-dependent serotonin transporter
Ligand
BDBM31005
Substrate
Meas. Tech.
ChEBML_184436
Ki
>1000±n/a nM
Citation
 Maryanoff, BEMcComsey, DFCastanzo, MJSetler, PEGardocki, JFShank, RPSchneider, CR Pyrroloisoquinoline antidepressants. Potent, enantioselective inhibition of tetrabenazine-induced ptosis and neuronal uptake of norepinephrine, dopamine, and serotonin. J Med Chem 27:943-6 (1984)  
Target
Name:
Sodium-dependent serotonin transporter
Synonyms:
5-HT Transporter 5HT transporter Anandamid membrane transporter, AMT Monoamine transporters; Norepinephrine & serotonin Slc6a4 Sodium-dependent serotonin transporter (SERT) | imipramine receptor
Type:
Multi-pass membrane protein
Mol. Mass.:
70168.43
Organism:
Rattus norvegicus (rat)
Description:
P31652
Residue:
630
  
Inhibitor
Name:
BDBM31005
Synonyms:
2-methyl-1,2,3,4,10,14b-hexahydrodibenzo[c,f]pyrazino[1,2-a]azepine MLS000069681 cid_68551
Type:
Small organic molecule
Emp. Form.:
C18H21ClN2
Mol. Mass.:
300.826
SMILES:
Cl.CN1CCN2C(C1)c1ccccc1Cc1ccccc21
: