Target
Adenosine receptor A1
Ligand
BDBM50452202
Substrate
Meas. Tech.
ChEBML_29335
Ki
4±n/a nM
Citation
 Moos, WHSzotek, DSBruns, RF N6-cycloalkyladenosines. Potent, A1-selective adenosine agonists. J Med Chem 28:1383-4 (1985)  
Target
Name:
Adenosine receptor A1
Synonyms:
AA1R_RAT ADENOSINE A1 high Adenosine A1 receptor (A1) Adenosine receptors A1 | Adora1
Type:
Protein
Mol. Mass.:
36704.13
Organism:
Rattus norvegicus (rat)
Description:
Residue:
326
  
Inhibitor
Name:
BDBM50452202
Synonyms:
CHEMBL2113424
Type:
Small organic molecule
Emp. Form.:
C18H27N5O4
Mol. Mass.:
377.4381
SMILES:
OC[C@H]1O[C@H]([C@H](O)[C@@H]1O)n1cnc2c(NC3CCCCCCC3)ncnc12
: