Target
Transporter
Ligand
BDBM50021215
Substrate
Meas. Tech.
ChEBML_176350
IC50
21±n/a nM
Citation
 Bøgesø, KPChristensen, AVHyttel, JLiljefors, T 3-Phenyl-1-indanamines. Potential antidepressant activity and potent inhibition of dopamine, norepinephrine, and serotonin uptake. J Med Chem 28:1817-28 (1986)  
Target
Name:
Transporter
Synonyms:
Monoamine transporters; Norepininephrine & dopamine | Norepinephrine Monoamine transporters
Type:
PROTEIN
Mol. Mass.:
66787.87
Organism:
Rattus norvegicus
Description:
ChEMBL_1463061
Residue:
597
  
Inhibitor
Name:
BDBM50021215
Synonyms:
CHEMBL553385 | [3-(3,4-Dichloro-phenyl)-6-fluoro-indan-1-yl]-dimethyl-amine; hydrochloride
Type:
Small organic molecule
Emp. Form.:
C17H16Cl2FN
Mol. Mass.:
324.22
SMILES:
CN(C)C1CC(c2ccc(F)cc12)c1ccc(Cl)c(Cl)c1
: