Target
Angiotensin-converting enzyme
Ligand
BDBM50020822
Substrate
Meas. Tech.
ChEBML_34797
IC50
100000±n/a nM
Citation
 Menard, PRSuh, JTJones, HLoev, BNeiss, ESWilde, JSchwab, AMann, WS Angiotensin converting enzyme inhibitors. (Mercaptoaroyl)amino acids. J Med Chem 28:328-32 (1985)  
Target
Name:
Angiotensin-converting enzyme
Synonyms:
3.2.1.- ACE Angiotensin-converting enzyme, soluble form DCP1 Kininase II
Type:
Mol. Mass.:
150405.15
Organism:
Oryctolagus cuniculus
Description:
Residue:
1310
  
Inhibitor
Name:
BDBM50020822
Synonyms:
CHEMBL112545 | [(4-Chloro-2-mercapto-benzoyl)-cyclopentyl-amino]-acetic acid
Type:
Small organic molecule
Emp. Form.:
C14H16ClNO3S
Mol. Mass.:
313.8
SMILES:
OC(=O)CN(C1CCCC1)C(=O)c1ccc(Cl)cc1S
: