Target
Angiotensin-converting enzyme
Ligand
BDBM50020826
Substrate
Meas. Tech.
ChEBML_34797
IC50
100000±n/a nM
Citation
 Menard, PRSuh, JTJones, HLoev, BNeiss, ESWilde, JSchwab, AMann, WS Angiotensin converting enzyme inhibitors. (Mercaptoaroyl)amino acids. J Med Chem 28:328-32 (1985)  
Target
Name:
Angiotensin-converting enzyme
Synonyms:
3.2.1.- ACE Angiotensin-converting enzyme, soluble form DCP1 Kininase II
Type:
Mol. Mass.:
150405.15
Organism:
Oryctolagus cuniculus
Description:
Residue:
1310
  
Inhibitor
Name:
BDBM50020826
Synonyms:
CHEMBL112630 | {Cyclopentyl-[2-(2,2-dimethyl-propionylsulfanyl)-benzoyl]-amino}-acetic acid
Type:
Small organic molecule
Emp. Form.:
C19H25NO4S
Mol. Mass.:
363.471
SMILES:
CC(C)(C)C(=O)Sc1ccccc1C(=O)N(CC(O)=O)C1CCCC1
: