Target
D(2) dopamine receptor
Ligand
BDBM81195
Substrate
Meas. Tech.
ChEMBL_59782 (CHEMBL671063)
IC50
0.000±n/a nM
Citation
 Neumeyer, JLGuan, JHNiznik, HBDumbrille-Ross, ASeeman, PPadmanabhan, SElmaleh, DR Novel photoaffinity label for the dopamine D2 receptor: synthesis of 4-azido-5-iodo-2-methoxy-N-[1-(phenylmethyl)-4-piperidinyl] benzamide (iodoazidoclebopride, IAC) and the corresponding 125I-labeled analogue (125IAC). J Med Chem 28:405-7 (1985)  
Target
Name:
D(2) dopamine receptor
Synonyms:
D(2) dopamine receptor DOPAMINE D2 Long DRD2 Dopamine D2 receptor Dopamine D2 receptor (D2R) Dopamine2-like | d2
Type:
Cell-surface receptors
Mol. Mass.:
50647.10
Organism:
Homo sapiens (Human)
Description:
P14416
Residue:
443
  
Inhibitor
Name:
BDBM81195
Synonyms:
(+/-)-2-Amino-6,7-dihydroxy-1,2,3,4-tetrahydronaphthalene hydrobromide 6-Amino-5,6,7,8-tetrahydro-naphthalene-2,3-diol 6-azanyl-5,6,7,8-tetrahydronaphthalene-2,3-diol;hydrobromide ADTN, (+) CHEMBL26736 SMR001254097 cid_3153
Type:
Small organic molecule
Emp. Form.:
C10H13NO2
Mol. Mass.:
179.2157
SMILES:
NC1CCc2cc(O)c(O)cc2C1
: