Target
Adenosine receptor A2a
Ligand
BDBM50018170
Substrate
Meas. Tech.
ChEBML_27639
Ki
7000±n/a nM
Citation
 Daly, JWPadgett, WShamim, MTButts-Lamb, PWaters, J 1,3-Dialkyl-8-(p-sulfophenyl)xanthines: potent water-soluble antagonists for A1- and A2-adenosine receptors. J Med Chem 28:487-92 (1985)  
Target
Name:
Adenosine receptor A2a
Synonyms:
AA2AR_CAVPO ADORA2A | Adenosine A2a receptor
Type:
Enzyme Catalytic Domain
Mol. Mass.:
44955.08
Organism:
GUINEA PIG
Description:
ADENOSINE A2 0 GUINEA PIG::P46616
Residue:
409
  
Inhibitor
Name:
BDBM50018170
Synonyms:
4-[3-Isobutyl-1-(3-methyl-butyl)-2,6-dioxo-2,3,6,7-tetrahydro-1H-purin-8-yl]-benzenesulfonic acid | CHEMBL279688
Type:
Small organic molecule
Emp. Form.:
C20H26N4O5S
Mol. Mass.:
434.509
SMILES:
CC(C)CCn1c(=O)n(CC(C)C)c2nc([nH]c2c1=O)-c1ccc(cc1)S(O)(=O)=O
: