Target
Adenosine receptor A1
Ligand
BDBM50020978
Substrate
Meas. Tech.
ChEMBL_28965 (CHEMBL640605)
IC50
7±n/a nM
Citation
 Hamilton, HWOrtwine, DFWorth, DFBadger, EWBristol, JABruns, RFHaleen, SJSteffen, RP Synthesis of xanthines as adenosine antagonists, a practical quantitative structure-activity relationship application. J Med Chem 28:1071-9 (1985)  
Target
Name:
Adenosine receptor A1
Synonyms:
AA1R_BOVIN ADENOSINE A1 high ADORA1 | Adenosine A1 receptor
Type:
Enzyme Catalytic Domain
Mol. Mass.:
36602.99
Organism:
BOVINE
Description:
ADENOSINE 0 BOVINE::P28190
Residue:
326
  
Inhibitor
Name:
BDBM50020978
Synonyms:
1-Allyl-8-(2-amino-4-methyl-phenyl)-3-methyl-3,7-dihydro-purine-2,6-dione | CHEMBL10984
Type:
Small organic molecule
Emp. Form.:
C16H17N5O2
Mol. Mass.:
311.3385
SMILES:
Cc1ccc(-c2nc3n(C)c(=O)n(CC=C)c(=O)c3[nH]2)c(N)c1
: