Target
Adenosine receptor A1
Ligand
BDBM50020996
Substrate
Meas. Tech.
ChEMBL_28965 (CHEMBL640605)
IC50
3.5±n/a nM
Citation
 Hamilton, HWOrtwine, DFWorth, DFBadger, EWBristol, JABruns, RFHaleen, SJSteffen, RP Synthesis of xanthines as adenosine antagonists, a practical quantitative structure-activity relationship application. J Med Chem 28:1071-9 (1985)  
Target
Name:
Adenosine receptor A1
Synonyms:
AA1R_BOVIN ADENOSINE A1 high ADORA1 | Adenosine A1 receptor
Type:
Enzyme Catalytic Domain
Mol. Mass.:
36602.99
Organism:
BOVINE
Description:
ADENOSINE 0 BOVINE::P28190
Residue:
326
  
Inhibitor
Name:
BDBM50020996
Synonyms:
8-Biphenyl-4-yl-1,3-dimethyl-3,7-dihydro-purine-2,6-dione | CHEMBL276401
Type:
Small organic molecule
Emp. Form.:
C19H16N4O2
Mol. Mass.:
332.3559
SMILES:
Cn1c2nc([nH]c2c(=O)n(C)c1=O)-c1ccc(cc1)-c1ccccc1
: