Target
Aminopeptidase N
Ligand
BDBM50025915
Substrate
Meas. Tech.
ChEMBL_32815 (CHEMBL646467)
IC50
8.5±n/a nM
Citation
 Fournié-Zaluski, MCCoulaud, ABouboutou, RChaillet, PDevin, JWaksman, GCostentin, JRoques, BP New bidentates as full inhibitors of enkephalin-degrading enzymes: synthesis and analgesic properties. J Med Chem 28:1158-69 (1985)  
Target
Name:
Aminopeptidase N
Synonyms:
AMPN_PIG AP-M Alanyl aminopeptidase Aminopeptidase N (APN) Microsomal aminopeptidase pAPN
Type:
Protein
Mol. Mass.:
108810.25
Organism:
Sus scrofa (Pig)
Description:
P15145
Residue:
963
  
Inhibitor
Name:
BDBM50025915
Synonyms:
CHEMBL16622 | [2-Benzyl-3-(formyl-hydroxy-amino)-propionylamino]-acetic acid
Type:
Small organic molecule
Emp. Form.:
C13H16N2O5
Mol. Mass.:
280.2765
SMILES:
ON(CC(Cc1ccccc1)C(=O)NCC(O)=O)C=O
: