Target
Aminopeptidase N
Ligand
BDBM50025913
Substrate
Meas. Tech.
ChEMBL_32815 (CHEMBL646467)
IC50
2.5±n/a nM
Citation
 Fournié-Zaluski, MCCoulaud, ABouboutou, RChaillet, PDevin, JWaksman, GCostentin, JRoques, BP New bidentates as full inhibitors of enkephalin-degrading enzymes: synthesis and analgesic properties. J Med Chem 28:1158-69 (1985)  
Target
Name:
Aminopeptidase N
Synonyms:
AMPN_PIG AP-M Alanyl aminopeptidase Aminopeptidase N (APN) Microsomal aminopeptidase pAPN
Type:
Protein
Mol. Mass.:
108810.25
Organism:
Sus scrofa (Pig)
Description:
P15145
Residue:
963
  
Inhibitor
Name:
BDBM50025913
Synonyms:
CHEMBL16457 | [2-(Formyl-hydroxy-amino)-3-phenyl-propionylamino]-acetic acid
Type:
Small organic molecule
Emp. Form.:
C12H14N2O5
Mol. Mass.:
266.25
SMILES:
ON(C=O)C(Cc1ccccc1)C(=O)NCC(O)=O
: