Target
Angiotensin-converting enzyme
Ligand
BDBM50017129
Substrate
Meas. Tech.
ChEBML_36890
IC50
140±n/a nM
Citation
 Klutchko, SBlankley, CJFleming, RWHinkley, JMWerner, AENordin, IHolmes, AHoefle, MLCohen, DMEssenburg, AD Synthesis of novel angiotensin converting enzyme inhibitor quinapril and related compounds. A divergence of structure-activity relationships for non-sulfhydryl and sulfhydryl types. J Med Chem 29:1953-61 (1986)  
Target
Name:
Angiotensin-converting enzyme
Synonyms:
ACE Angiotensin converting enzyme (ACE) Angiotensin-converting enzyme, soluble form CD_antigen=CD143 DCP1 Kininase II
Type:
Enzyme
Mol. Mass.:
149709.01
Organism:
Homo sapiens (Human)
Description:
Residue:
1306
  
Inhibitor
Name:
BDBM50017129
Synonyms:
(S)-1-((S)-2-((R)-1-ethoxy-1-oxo-4-phenylbutan-2-ylamino)propanoyl)pyrrolidine-2-carboxylic acid (S)-1-{(S)-2-[1-((S)-Ethoxycarbonyl)-3-phenyl-propylamino]-propionyl}-pyrrolidine-2-carboxylic acid (SSS)1-[2-(1-Ethoxycarbonyl-3-phenyl-propylamino)-propionyl]-pyrrolidine-2-carboxylic acid 1-[2-(1-Ethoxycarbonyl-3-phenyl-propylamino)-propionyl]-pyrrolidine-2-carboxylic acid (Enalapril) 2-[2-(1-Carboxy-3-phenyl-propylamino)-propionyl]-1,2,3,4-tetrahydro-isoquinoline-3-carboxylic acid(enalapril) ENALAPRIL Lexxel Vaseretic | Vasotec
Type:
Small organic molecule
Emp. Form.:
C20H28N2O5
Mol. Mass.:
376.4467
SMILES:
CCOC(=O)[C@H](CCc1ccccc1)N[C@@H](C)C(=O)N1CCC[C@H]1C(O)=O
: