Target
Androgen receptor
Ligand
BDBM50367296
Substrate
Meas. Tech.
ChEBML_36310
IC50
1900±n/a nM
Citation
 Rasmusson, GHReynolds, GFSteinberg, NGWalton, EPatel, GFLiang, TCascieri, MACheung, AHBrooks, JRBerman, C Azasteroids: structure-activity relationships for inhibition of 5 alpha-reductase and of androgen receptor binding. J Med Chem 29:2298-315 (1986)  
Target
Name:
Androgen receptor
Synonyms:
ANDR_RAT Ar Nr3c4 | androgen
Type:
Enzyme
Mol. Mass.:
98219.08
Organism:
Rattus norvegicus (Rat)
Description:
P15207
Residue:
902
  
Inhibitor
Name:
BDBM50367296
Synonyms:
CHEMBL1790284
Type:
Small organic molecule
Emp. Form.:
C21H35NO3
Mol. Mass.:
349.5075
SMILES:
CC(O)[C@@]1(O)CC[C@H]2[C@@H]3CCC4N(C)C(=O)CC[C@]4(C)[C@H]3CC[C@]12C
: