Target
Pepsin A
Ligand
BDBM50025526
Substrate
Meas. Tech.
ChEBML_154162
Ki
3.3±n/a nM
Citation
 Agarwal, NSRich, DH Inhibition of cathepsin D by substrate analogues containing statine and by analogues of pepstatin. J Med Chem 29:2519-24 (1987)  
Target
Name:
Pepsin A
Synonyms:
PEPA_PIG Pepsin | Pepsin A precursor
Type:
Enzyme
Mol. Mass.:
41232.87
Organism:
Porcine
Description:
Residue:
385
  
Inhibitor
Name:
BDBM50025526
Synonyms:
(1-{1-[1-(1-{1-Hydroxy-2-[1-(3-methyl-butylcarbamoyl)-ethylcarbamoyl]-ethyl}-3-methyl-butylcarbamoyl)-ethylcarbamoyl]-ethylcarbamoyl}-2-phenyl-ethyl)-carbamic acid tert-butyl ester | CHEMBL3142509
Type:
Small organic molecule
Emp. Form.:
C36H60N6O8
Mol. Mass.:
704.897
SMILES:
CC(C)CCNC(=O)[C@H](C)NC(=O)C[C@H](O)[C@H](CC(C)C)NC(=O)[C@H](C)NC(=O)[C@H](C)NC(=O)[C@H](Cc1ccccc1)NC(=O)OC(C)(C)C
: