Target
Gastricsin
Ligand
BDBM50025526
Substrate
Meas. Tech.
ChEBML_153843
Ki
210±n/a nM
Citation
 Agarwal, NSRich, DH Inhibition of cathepsin D by substrate analogues containing statine and by analogues of pepstatin. J Med Chem 29:2519-24 (1987)  
Target
Name:
Gastricsin
Synonyms:
Gastricsin PGC | Pepsinogen C
Type:
PROTEIN
Mol. Mass.:
42409.17
Organism:
Homo sapiens (Human)
Description:
ChEMBL_1452207
Residue:
388
  
Inhibitor
Name:
BDBM50025526
Synonyms:
(1-{1-[1-(1-{1-Hydroxy-2-[1-(3-methyl-butylcarbamoyl)-ethylcarbamoyl]-ethyl}-3-methyl-butylcarbamoyl)-ethylcarbamoyl]-ethylcarbamoyl}-2-phenyl-ethyl)-carbamic acid tert-butyl ester | CHEMBL3142509
Type:
Small organic molecule
Emp. Form.:
C36H60N6O8
Mol. Mass.:
704.897
SMILES:
CC(C)CCNC(=O)[C@H](C)NC(=O)C[C@H](O)[C@H](CC(C)C)NC(=O)[C@H](C)NC(=O)[C@H](C)NC(=O)[C@H](Cc1ccccc1)NC(=O)OC(C)(C)C
: