Target
S-adenosylmethionine synthase isoform type-2
Ligand
BDBM50367303
Substrate
Meas. Tech.
ChEMBL_105120 (CHEMBL713238)
Ki
410000±n/a nM
Citation
 Kappler, FHai, TTHampton, A Isozyme-specific enzyme inhibitors. 10. Adenosine 5'-triphosphate derivatives as substrates or inhibitors of methionine adenosyltransferases of rat normal and hepatoma tissues. J Med Chem 29:318-22 (1986)  
Target
Name:
S-adenosylmethionine synthase isoform type-2
Synonyms:
AdoMet synthetase 2 MAT 2 METK2_RAT Methionine adenosyltransferase 2 S-Adenosylmethionine Synthase (AdoMet) S-adenosylmethionine synthetase gamma form | S-adenosylmethionine synthetase isoform type-2
Type:
PROTEIN
Mol. Mass.:
43713.68
Organism:
Rattus norvegicus
Description:
ChEMBL_105118
Residue:
395
  
Inhibitor
Name:
BDBM50367303
Synonyms:
CHEMBL1791433
Type:
Small organic molecule
Emp. Form.:
C11H18N5O13P3S
Mol. Mass.:
553.273
SMILES:
CSC(OP(O)(=O)OP(O)(=O)OP(O)(O)=O)[C@H]1O[C@H]([C@H](O)[C@@H]1O)n1cnc2c(N)ncnc12
: