Target
Kappa-type opioid receptor
Ligand
BDBM50021323
Substrate
Meas. Tech.
ChEMBL_145704 (CHEMBL753912)
Kd
137±n/a nM
Citation
 Cheng, AUyeno, EPolgar, WToll, LLawson, JADeGraw, JILoew, GCamerman, ACamerman, N N-substituent modulation of opiate agonist/antagonist activity in resolved 3-methyl-3-(m-hydroxyphenyl)piperidines. J Med Chem 29:531-7 (1986)  
Target
Name:
Kappa-type opioid receptor
Synonyms:
KOR-1 OPIATE Kappa Opioid receptor Ror-d
Type:
G Protein-Coupled Receptor (GPCR)
Mol. Mass.:
42692.90
Organism:
Rattus norvegicus (rat)
Description:
P34975
Residue:
380
  
Inhibitor
Name:
BDBM50021323
Synonyms:
3-(1-Allyl-3-methyl-piperidin-3-yl)-phenol CHEMBL151270
Type:
Small organic molecule
Emp. Form.:
C15H21NO
Mol. Mass.:
231.3333
SMILES:
CC1(CCCN(CC=C)C1)c1cccc(O)c1
: