Target
Maltase-glucoamylase
Ligand
BDBM50024116
Substrate
Meas. Tech.
ChEBML_101862
IC50
190±n/a nM
Citation
 Horii, SFukase, HMatsuo, TKameda, YAsano, NMatsui, K Synthesis and alpha-D-glucosidase inhibitory activity of N-substituted valiolamine derivatives as potential oral antidiabetic agents. J Med Chem 29:1038-46 (1986)  
Target
Name:
Maltase-glucoamylase
Synonyms:
Alpha glucosidase MGA MGAML Maltase | Maltase-glucoamylase, intestinal
Type:
Enzyme
Mol. Mass.:
209817.06
Organism:
Homo sapiens (Human)
Description:
O43451
Residue:
1857
  
Inhibitor
Name:
BDBM50024116
Synonyms:
1-Hydroxymethyl-5-(2-hydroxy-2-phenyl-ethylamino)-cyclohexane-1,2,3,4-tetraol | CHEMBL2374255
Type:
Small organic molecule
Emp. Form.:
C15H23NO6
Mol. Mass.:
313.3462
SMILES:
[H][C@@](O)(CN[C@H]1C[C@](O)(CO)[C@H](O)[C@@H](O)[C@H]1O)c1ccccc1
: