Target
Sucrase-isomaltase, intestinal
Ligand
BDBM50024136
Substrate
Meas. Tech.
ChEBML_206286
IC50
6.80±n/a nM
Citation
 Horii, SFukase, HMatsuo, TKameda, YAsano, NMatsui, K Synthesis and alpha-D-glucosidase inhibitory activity of N-substituted valiolamine derivatives as potential oral antidiabetic agents. J Med Chem 29:1038-46 (1986)  
Target
Name:
Sucrase-isomaltase, intestinal
Synonyms:
Alpha glucosidase SI Sucrase Sucrase-isomaltase, intestinal
Type:
PROTEIN
Mol. Mass.:
209423.23
Organism:
Homo sapiens (Human)
Description:
ChEMBL_1435477
Residue:
1827
  
Inhibitor
Name:
BDBM50024136
Synonyms:
5-(3,5-Di-tert-butyl-4-hydroxy-benzylamino)-1-hydroxymethyl-cyclohexane-1,2,3,4-tetraol | CHEMBL3349442
Type:
Small organic molecule
Emp. Form.:
C22H37NO6
Mol. Mass.:
411.5323
SMILES:
CC(C)(C)c1cc(CN[C@H]2C[C@](O)(CO)[C@@H](O)[C@H](O)[C@H]2O)cc(c1O)C(C)(C)C
: