Target
Sucrase-isomaltase, intestinal
Ligand
BDBM50405397
Substrate
Meas. Tech.
ChEBML_206286
IC50
10±n/a nM
Citation
 Horii, SFukase, HMatsuo, TKameda, YAsano, NMatsui, K Synthesis and alpha-D-glucosidase inhibitory activity of N-substituted valiolamine derivatives as potential oral antidiabetic agents. J Med Chem 29:1038-46 (1986)  
Target
Name:
Sucrase-isomaltase, intestinal
Synonyms:
Alpha glucosidase SI Sucrase Sucrase-isomaltase, intestinal
Type:
PROTEIN
Mol. Mass.:
209423.23
Organism:
Homo sapiens (Human)
Description:
ChEMBL_1435477
Residue:
1827
  
Inhibitor
Name:
BDBM50405397
Synonyms:
CHEMBL2051983
Type:
Small organic molecule
Emp. Form.:
C14H27NO9
Mol. Mass.:
353.3655
SMILES:
CO[C@H]1O[C@H](C)[C@@H](N[C@H]2C[C@](O)(CO)[C@@H](O)[C@H](O)[C@H]2O)[C@H](O)[C@H]1O
: