Target
Histamine H1 receptor
Ligand
BDBM50019632
Substrate
Meas. Tech.
ChEBML_75330
IC50
26±n/a nM
Citation
 Iemura, RKawashima, TFukuda, TIto, KTsukamoto, G Synthesis of 2-(4-substituted-1-piperazinyl)benzimidazoles as H1-antihistaminic agents. J Med Chem 29:1178-83 (1987)  
Target
Name:
Histamine H1 receptor
Synonyms:
HISTAMINE H1 HRH1_CAVPO
Type:
G Protein-Coupled Receptor (GPCR)
Mol. Mass.:
55641.53
Organism:
Cavia porcellus (domestic guinea pig)
Description:
Guinea pig cerebellum was used in binding assay.
Residue:
488
  
Inhibitor
Name:
BDBM50019632
Synonyms:
1-Hexyl-2-(4-methyl-piperazin-1-yl)-1H-benzoimidazole | CHEMBL278457
Type:
Small organic molecule
Emp. Form.:
C18H28N4
Mol. Mass.:
300.4417
SMILES:
CCCCCCn1c(nc2ccccc12)N1CCN(C)CC1
: