Target
Thymidylate synthase
Ligand
BDBM50008291
Substrate
Meas. Tech.
ChEMBL_209956 (CHEMBL820612)
IC50
>3000000±n/a nM
Citation
 Ghazala, MNair, MGToghiyani, TRKisliuk, RLGaumont, YKalman, TI Folate analogues. 25. Synthesis and biological evaluation of N10-propargylfolic acid and its reduced derivatives. J Med Chem 29:1263-9 (1987)  
Target
Name:
Thymidylate synthase
Synonyms:
TS TYSY_MOUSE | Tyms
Type:
PROTEIN
Mol. Mass.:
34957.15
Organism:
Mus musculus
Description:
ChEMBL_1340097
Residue:
307
  
Inhibitor
Name:
BDBM50008291
Synonyms:
2-{4-[(2-Amino-4-oxo-1,4-dihydro-pteridin-6-ylmethyl)-prop-2-ynyl-amino]-benzoylamino}-pentanedioic acid CHEMBL280145
Type:
Small organic molecule
Emp. Form.:
C22H21N7O6
Mol. Mass.:
479.4454
SMILES:
Nc1nc2ncc(CN(CC#C)c3ccc(cc3)C(=O)NC(CCC(O)=O)C(O)=O)nc2c(=O)[nH]1
: