Target
Adenosine receptor A1
Ligand
BDBM50367376
Substrate
Meas. Tech.
ChEBML_28538
IC50
70±n/a nM
Citation
 Olsson, RAKusachi, SThompson, RDUkena, DPadgett, WDaly, JW N6-substituted N-alkyladenosine-5'-uronamides: bifunctional ligands having recognition groups for A1 and A2 adenosine receptors. J Med Chem 29:1683-9 (1986)  
Target
Name:
Adenosine receptor A1
Synonyms:
AA1R_RAT ADENOSINE A1 high Adenosine A1 receptor (A1) Adenosine receptors A1 | Adora1
Type:
Protein
Mol. Mass.:
36704.13
Organism:
Rattus norvegicus (rat)
Description:
Residue:
326
  
Inhibitor
Name:
BDBM50367376
Synonyms:
CHEMBL605866
Type:
Small organic molecule
Emp. Form.:
C10H12N6O4
Mol. Mass.:
280.2401
SMILES:
NC(=O)[C@H]1OC([C@H](O)[C@@H]1O)n1cnc2c(N)ncnc12
: