Target
D(2) dopamine receptor
Ligand
BDBM50019957
Substrate
Meas. Tech.
ChEBML_62078
Ki
9.30±n/a nM
Citation
 van Wijngaarden, IKruse, CGvan Hes, Rvan der Heyden, JATulp, MT 2-Phenylpyrroles as conformationally restricted benzamide analogues. A new class of potential antipsychotics. 1. J Med Chem 30:2099-104 (1987)  
Target
Name:
D(2) dopamine receptor
Synonyms:
DOPAMINE D2 DOPAMINE D2 Short Dopamine D2 receptor Drd2
Type:
G Protein-Coupled Receptor (GPCR)
Mol. Mass.:
50931.60
Organism:
Rattus norvegicus (rat)
Description:
P61169
Residue:
444
  
Inhibitor
Name:
BDBM50019957
Synonyms:
5-Ethanesulfonyl-N-(1-ethyl-pyrrolidin-2-ylmethyl)-2-methoxy-benzamide((S)-sultopride) Sultopride
Type:
Small organic molecule
Emp. Form.:
C17H26N2O4S
Mol. Mass.:
354.464
SMILES:
CCN1CCC[C@H]1CNC(=O)c1cc(ccc1OC)S(=O)(=O)CC
: