Target
Polyunsaturated fatty acid 5-lipoxygenase
Ligand
BDBM50024844
Substrate
Meas. Tech.
ChEMBL_3926 (CHEMBL619929)
IC50
20000±n/a nM
Citation
 Buckle, DRFoster, KATaylor, JFTedder, JMThody, VEWebster, RABermudez, JMarkwell, RESmith, SA Novel 1H-benzimidazol-4-ols with potent 5-lipoxygenase inhibitory activity. J Med Chem 30:2216-21 (1988)  
Target
Name:
Polyunsaturated fatty acid 5-lipoxygenase
Synonyms:
Alox5 LOX5_RAT
Type:
PROTEIN
Mol. Mass.:
78082.31
Organism:
Rattus norvegicus
Description:
ChEMBL_1432947
Residue:
673
  
Inhibitor
Name:
BDBM50024844
Synonyms:
2-Benzyl-1H-benzoimidazol-4-ol | CHEMBL306680
Type:
Small organic molecule
Emp. Form.:
C14H12N2O
Mol. Mass.:
224.2579
SMILES:
Oc1cccc2[nH]c(Cc3ccccc3)nc12
: