Target
Thromboxane-A synthase
Ligand
BDBM50024936
Substrate
Meas. Tech.
ChEBML_210118
IC50
12±n/a nM
Citation
 Wright, WBTomcufcik, ASChan, PSMarsico, JWPress, JB Thromboxane synthetase inhibitors and antihypertensive agents. 4. N-[(1H-imidazol-1-yl)alkyl] derivatives of quinazoline-2,4(1H,3H)-diones, quinazolin-4(3H)-ones, and 1,2,3-benzotriazin-4(3H)-ones. J Med Chem 30:2277-83 (1988)  
Target
Name:
Thromboxane-A synthase
Synonyms:
Cyp5 Cytochrome P450 5A1 TXA synthase Tbxas1
Type:
PROTEIN
Mol. Mass.:
59971.80
Organism:
Rattus norvegicus
Description:
ChEMBL_209768
Residue:
533
  
Inhibitor
Name:
BDBM50024936
Synonyms:
6-Chloro-3-(5-imidazol-1-yl-pentyl)-1H-quinazoline-2,4-dione | CHEMBL73143
Type:
Small organic molecule
Emp. Form.:
C16H17ClN4O2
Mol. Mass.:
332.785
SMILES:
Clc1ccc2[nH]c(=O)n(CCCCCn3ccnc3)c(=O)c2c1
: