Target
Ryanodine receptor 1
Ligand
BDBM50016418
Substrate
Meas. Tech.
ChEMBL_921272 (CHEMBL3054398)
IC50
100±n/a nM
Citation
 Waterhouse, ALPessah, INFrancini, AOCasida, JE Structural aspects of ryanodine action and selectivity. J Med Chem 30:710-6 (1987)  
Target
Name:
Ryanodine receptor 1
Synonyms:
RYR-1 RYR1_RABIT Skeletal muscle ryanodine receptor Type 1 ryanodine receptor
Type:
PROTEIN
Mol. Mass.:
565099.26
Organism:
Oryctolagus cuniculus
Description:
ChEMBL_19634
Residue:
5037
  
Inhibitor
Name:
BDBM50016418
Synonyms:
10-KETORYANODINE CHEMBL348796
Type:
Small organic molecule
Emp. Form.:
C25H33NO9
Mol. Mass.:
491.5308
SMILES:
CC(C)[C@@]1(O)[C@@H](OC(=O)c2ccc[nH]2)[C@@]2(O)[C@@]3(C)C[C@]4(O)O[C@@]5(C(=O)[C@@H](C)CC[C@]35O)[C@@]2(O)[C@]14C
: