Target
Gamma-aminobutyric acid type B receptor subunit 1/2
Ligand
BDBM50021758
Substrate
Meas. Tech.
ChEMBL_68566 (CHEMBL679653)
IC50
>100000±n/a nM
Citation
 Berthelot, PVaccher, CMusadad, AFlouquet, NDebaert, MLuyckx, M Synthesis and pharmacological evaluation of gamma-aminobutyric acid analogues. New ligand for GABAB sites. J Med Chem 30:743-6 (1987)  
Target
Name:
Gamma-aminobutyric acid type B receptor subunit 1/2
Synonyms:
GABA B receptor | GABA-B receptor 1/2
Type:
Mol. Mass.:
Description:
ASSAY_ID of EBI is 68556
Components:
This complex has 2 components.
Component 1
Name:
Gamma-aminobutyric acid type B receptor subunit 1
Synonyms:
GABA B GABA uptake GABA-B-R1 GABABR1 Gabbr1 | Gb1
Type:
Enzyme Catalytic Domain
Mol. Mass.:
111548.69
Organism:
Rattus norvegicus (Rat)
Description:
Q9Z0U4
Residue:
991
  
Component 2
Name:
Gamma-aminobutyric acid type B receptor subunit 2
Synonyms:
GABA B receptor Gabbr2 | Gpr51
Type:
PROTEIN
Mol. Mass.:
105775.46
Organism:
Rattus norvegicus
Description:
O88871
Residue:
940
  
Inhibitor
Name:
BDBM50021758
Synonyms:
4-Amino-3-(2,3-dihydro-benzofuran-2-yl)-butyric acid | CHEMBL162149
Type:
Small organic molecule
Emp. Form.:
C12H15NO3
Mol. Mass.:
221.2524
SMILES:
NCC(CC(O)=O)C1Cc2ccccc2O1
: