Target
Aromatase
Ligand
BDBM50024481
Substrate
Meas. Tech.
ChEBML_51214
EC50
66±n/a nM
Citation
 Taylor, HMJones, CDDavenport, JDHirsch, KSKress, TJWeaver, D Aromatase inhibition by 5-substituted pyrimidines and dihydropyrimidines. J Med Chem 30:1359-65 (1987)  
Target
Name:
Aromatase
Synonyms:
Arom CP19A_RAT Cyp19 Cytochrome P450 19A1 P-450AROM
Type:
PROTEIN
Mol. Mass.:
58418.09
Organism:
Rattus norvegicus
Description:
ChEMBL_51211
Residue:
508
  
Inhibitor
Name:
BDBM50024481
Synonyms:
(4-Chloro-phenyl)-pyrimidin-5-yl-(4-trifluoromethyl-phenyl)-methanol | CHEMBL28637
Type:
Small organic molecule
Emp. Form.:
C18H12ClF3N2O
Mol. Mass.:
364.749
SMILES:
OC(c1ccc(Cl)cc1)(c1ccc(cc1)C(F)(F)F)c1cncnc1
: