Target
Cytosol aminopeptidase
Ligand
BDBM50024601
Substrate
Meas. Tech.
ChEBML_98405
Ki
1000±n/a nM
Citation
 Giannousis, PPBartlett, PA Phosphorus amino acid analogues as inhibitors of leucine aminopeptidase. J Med Chem 30:1603-9 (1987)  
Target
Name:
Cytosol aminopeptidase
Synonyms:
AMPL_HUMAN LAP3 Leucine aminopeptidase | PEPS
Type:
PROTEIN
Mol. Mass.:
56171.75
Organism:
Homo sapiens (Human)
Description:
ChEMBL_1507539
Residue:
519
  
Inhibitor
Name:
BDBM50024601
Synonyms:
1-Ammonium-hexane-1-phosphonic acid anion CHEMBL40508
Type:
Small organic molecule
Emp. Form.:
C6H16NO3P
Mol. Mass.:
181.1699
SMILES:
CCCCCC([NH3+])P(O)([O-])=O
: