Target
Adenosine receptor A1
Ligand
BDBM50367597
Substrate
Meas. Tech.
ChEBML_29324
Ki
12±n/a nM
Citation
 Trivedi, BKBristol, JABruns, RFHaleen, SJSteffen, RP N6-(arylalkyl)adenosines. Identification of N6-(9-fluorenylmethyl)adenosine as a highly potent agonist for the adenosine A2 receptor. J Med Chem 31:271-3 (1988)  
Target
Name:
Adenosine receptor A1
Synonyms:
AA1R_RAT ADENOSINE A1 high Adenosine A1 receptor (A1) Adenosine receptors A1 | Adora1
Type:
Protein
Mol. Mass.:
36704.13
Organism:
Rattus norvegicus (rat)
Description:
Residue:
326
  
Inhibitor
Name:
BDBM50367597
Synonyms:
CHEMBL604617
Type:
Small organic molecule
Emp. Form.:
C22H23N5O4
Mol. Mass.:
421.4491
SMILES:
OC[C@H]1OC([C@H](O)[C@@H]1O)n1cnc2c(NCCc3cccc4ccccc34)ncnc12
: