Target
Alpha-2A/Alpha-2B/Alpha-2C adrenergic receptor
Ligand
BDBM50029050
Substrate
Meas. Tech.
ChEMBL_33183 (CHEMBL642057)
Ki
5±n/a nM
Citation
 Adejare, AGusovsky, FPadgett, WCreveling, CRDaly, JWKirk, KL Syntheses and adrenergic activities of ring-fluorinated epinephrines. J Med Chem 31:1972-7 (1988)  
Target
Name:
Alpha-2A/Alpha-2B/Alpha-2C adrenergic receptor
Synonyms:
Adrenergic Receptors (alpha 2) | Adrenergic receptor alpha-2
Type:
Mol. Mass.:
Description:
ASSAY_ID of ChEMBL is 305672
Components:
This complex has 3 components.
Component 1
Name:
Alpha-2B adrenergic receptor
Synonyms:
ADA2B_HUMAN ADRA2L1 Adrenergic alpha2B Adrenergic receptor alpha Alpha-2 adrenergic receptor subtype C2 Alpha-2B adrenoreceptor | Alpha-2BAR
Type:
Enzyme
Mol. Mass.:
49964.20
Organism:
Homo sapiens (Human)
Description:
P18089
Residue:
450
  
Component 2
Name:
Alpha-2A adrenergic receptor
Synonyms:
ADA2A_HUMAN ADRA2R Adrenergic alpha2A Alpha-2 adrenergic receptor subtype C10 Alpha-2A adrenoreceptor alpha-2A adrenergic receptor [Homo sapiens]
Type:
Enzyme
Mol. Mass.:
48979.91
Organism:
Homo sapiens (Human)
Description:
P08913
Residue:
450
  
Component 3
Name:
Alpha-2C adrenergic receptor
Synonyms:
ADA2C_HUMAN ADRA2L2 Adrenergic alpha2C Adrenergic receptor alpha Alpha-2 adrenergic receptor subtype C4 Alpha-2C adrenoreceptor | adrenergic, alpha-2C-, receptor [Homo sapiens]
Type:
Enzyme
Mol. Mass.:
49552.32
Organism:
Homo sapiens (Human)
Description:
P18825
Residue:
462
  
Inhibitor
Name:
BDBM50029050
Synonyms:
(-)-(R)-epinephrine (-)-adrenaline (R)-adrenaline Adrenalin EPINEPHRINE levoepinephrine
Type:
Small organic molecule
Emp. Form.:
C9H13NO3
Mol. Mass.:
183.2044
SMILES:
CNC[C@H](O)c1ccc(O)c(O)c1
: