Target
Cytosol aminopeptidase
Ligand
BDBM50022751
Substrate
Meas. Tech.
ChEBML_98398
Ki
1000±n/a nM
Citation
 Ocain, TDRich, DH Synthesis of sulfur-containing analogues of bestatin. Inhibition of aminopeptidases by alpha-thiolbestatin analogues. J Med Chem 31:2193-9 (1988)  
Target
Name:
Cytosol aminopeptidase
Synonyms:
AMPL_HUMAN LAP3 Leucine aminopeptidase | PEPS
Type:
PROTEIN
Mol. Mass.:
56171.75
Organism:
Homo sapiens (Human)
Description:
ChEMBL_1507539
Residue:
519
  
Inhibitor
Name:
BDBM50022751
Synonyms:
2-(3-Amino-2-mercapto-4-phenyl-butyrylamino)-4-methyl-pentanoic acid: CHEMBL305198
Type:
Small organic molecule
Emp. Form.:
C16H24N2O3S
Mol. Mass.:
324.438
SMILES:
CC(C)C[C@H](NC(=O)[C@@H](S)[C@H](N)Cc1ccccc1)C(O)=O
: