Target
Voltage-dependent L-type calcium channel subunit alpha-1C
Ligand
BDBM50227241
Substrate
Meas. Tech.
ChEMBL_42776 (CHEMBL660040)
IC50
<1±n/a nM
Comments
Zero 12/22/2021
Citation
 Sanfilippo, PJUrbanski, MPress, JBDubinsky, BMoore, JB Synthesis of (aryloxy)alkylamines. 2. Novel imidazo-fused heterocycles with calcium channel blocking and local anesthetic activity. J Med Chem 31:2221-7 (1988)  
Target
Name:
Voltage-dependent L-type calcium channel subunit alpha-1C
Synonyms:
CAC1C_RABIT CACN2 CACNL1A1 L-type calcium channel alpha 1C/beta 2A | Voltage-gated L-type calcium channel alpha-1C subunit
Type:
PROTEIN
Mol. Mass.:
242793.78
Organism:
Oryctolagus cuniculus
Description:
ChEMBL_42776
Residue:
2171
  
Inhibitor
Name:
BDBM50227241
Synonyms:
CHEMBL1202817
Type:
Small organic molecule
Emp. Form.:
C24H35ClN4O
Mol. Mass.:
431.014
SMILES:
Cl.CCCCN(CCCC)CCCOc1ccc(cc1)-c1cn2ccc(C)nc2n1
: